{"text_format":"1","workbook":"xlsx","n_sheets":4,"sheets":["Inštrukcie","Žiadosť","Config","Data"],"not_rendered":{"charts":0,"images":2,"macros":1,"external_links":0,"defined_names":2,"comments":0,"pivot_tables":0},"unopened":[],"bounds":{"document_bytes":16777216,"sheet_cells":100000,"rows_first":2000,"rows_last":500,"rows_between":2000,"halvings":0,"cell_chars":16384,"cell_head_chars":4096},"cells_cut":0,"cells_raw":0,"read":"whole","date_system":"1900"}

{"sheet":"Inštrukcie","index":0,"n_rows":23,"n_cols":3,"rows_kept":23,"cut":false,"hidden":false,"merged":[]}
[]
[]
[]
[null,null,"Prílohy, ktoré je potrebné doložiť Ministerstvu zdravotníctva Slovenskej republiky na účely uzatvorenia zmluvy o spôsobe vzájomnej elektronickej komunikáciepodľa § 75 ods. 6 zákona č. 363/2011 Z. z. "]
[null,null," "]
[null,null,"1) Výpis z obchodného registra alebo živnostenského registra"]
[null,null,"Vyžaduje sa originál alebo osvedčená kópia."]
[null,null,"Nie starší ako jeden mesiac. "]
[null,null,"Predkladá sa, ak Žiadateľom je právnická osoba so sídlom v Slovenskej republike alebo fyzická osoba - podnikateľ s miestom podnikania v Slovenskej republike.  "]
[null,null,"Predkladá sa, ak Žiadateľ splnomocnil na konanie právnickú osobu so sídlom v Slovenskej republike alebo fyzickú osobu - podnikateľa s miestom podnikania v Slovenskej republike. "]
[null,null," "]
[null,null," "]
[null,null,"2) Plnomocenstvo udelené Žiadateľom (primárne)"]
[null,null,"Vyžaduje sa originál alebo osvedčená kópia."]
[null,null,"Vyžaduje sa v štátnom jazyku alebo s doložením úradného prekladu. Český jazyk je akceptovaný."]
[null,null,"Vyžaduje sa všeobecné plnomocenstvo alebo plnomocenstvo, z ktorého vyplýva oprávnenie podávať ministerstvu žiadosti a/alebo iné podania vo veciach kategorizácie a/alebo úradného určenia cien liekov. "]
[null,null,"Predkladá sa, ak o uzatvorenie zmluvy žiada iná fyzická osoba ako štatutárny orgán Žiadateľa, ktorý je oprávnený konať v mene Žiadateľa samostatne. "]
[null,null," "]
[null,null,"3) Plnomocenstvo udelené zástupcom Žiadateľa (sekundárne)"]
[null,null,"Vyžaduje sa originál alebo osvedčená kópia."]
[null,null,"Vyžaduje sa v štátnom jazyku alebo s doložením úradného prekladu. Český jazyk je akceptovaný."]
[null,null,"Musí vyplývať z obsahu primárneho plnomocenstva. "]
[null,null,"Predkladá sa, ak o uzatvorenie zmluvy žiada iná fyzická osoba ako štatutárny orgán zástupcu Žiadateľa, ktorý je oprávnený konať v mene zástupcu Žiadateľa samostatne. "]

{"sheet":"Žiadosť","index":1,"n_rows":43,"n_cols":16383,"rows_kept":43,"cut":false,"hidden":false,"merged":[[18,2,18,5],[19,2,19,5],[16,2,16,5],[23,2,23,5],[24,2,24,5],[41,2,41,6],[27,2,27,5],[29,2,29,6],[28,2,28,6],[35,5,35,6],[30,2,30,6],[31,2,31,6],[32,2,32,6],[33,2,33,6],[4,2,4,6],[6,2,6,6],[14,2,14,6],[9,2,9,5],[10,2,10,5],[11,2,11,5],[12,2,12,5],[13,2,13,4],[8,2,8,5],[25,2,25,5],[21,2,21,6],[26,2,26,6],[17,2,17,5]]}
[]
[]
[null,null,null,null,null,null,"Číslo žiadosti............................\n(vyplní Ministerstvo zdravotníctva Slovenskej republiky)"]
[]
[null,null,"Ž I A D O S Ť\nO   U Z A T V O R E N I E   Z M L U V Y "]
[null,null," "]
[null,null,"o spôsobe vzájomnej elektronickej komunikácie podľa § 75 ods. 6 zákona č. 363/2011 Z. z. o rozsahu a podmienkach úhrady liekov, zdravotníckych pomôcok a dietetických potravín na základe verejného zdravotného poistenia a o zmene a doplnení niektorých zákonov (ďalej len „zmluva“). "]
[null,null," "]
[null,null,"Žiadateľ: ",null,null,null,"Vyberte položku zo zoznamu"]
[null,null,"Obchodné meno,\nalebo meno a priezvisko: ",null,null,null,"Zadajte text"]
[null,null,"Sídlo alebo adresa trvalého pobytu:",null,null,null,"Zadajte text"]
[null,null,"IČO alebo dátum narodenia: ",null,null,null,"Zadajte text"]
[null,null,"Štatutárny orgán (uvádza sa v prípade právnickej osoby): ",null,null,null,"Zadajte text"]
[]
[null,null,"v zastúpení (uvádza sa, ak je určený splnomocnený zástupca Žiadateľa):"]
[]
[null,null,"Obchodné meno,\nalebo meno a priezvisko: "]
[null,null,"Sídlo alebo adresa trvalého pobytu:"]
[null,null,"IČO alebo dátum narodenia: "]
[null,null,"Štatutárny orgán (uvádza sa v prípade právnickej osoby): "]
[null,null," "]
[null,null,"v zastúpení (uvádza sa, ak o uzatvorenie zmluvy žiada iná fyzická osoba ako štatutárny orgán zástupcu Žiadateľa, ktorý je oprávnený konať v mene zástupcu Žiadateľa samostatne.) "]
[null,null," "]
[null,null,"Meno a priezvisko:    "]
[null,null,"Adresa trvalého pobytu: "]
[null,null,"Dátum narodenia: "]
[]
[null,null,"Dolupodpísaný/-ná"]
[null,null,"Zadajte meno a priezvisko splnomocnenej osoby"]
[null,null,"              týmto žiadam Ministerstvo zdravotníctva Slovenskej republiky, Limbová 2, 837 52 Bratislava "]
[null,null,"(ďalej len „ministerstvo“) o uzatvorenie zmluvy o spôsobe vzájomnej elektronickej komunikácie podľa"]
[null,null,"§ 75 ods. 6 zákona č. 363/2011 Z. z. o rozsahu a podmienkach úhrady liekov, zdravotníckych pomôcok"]
[null,null,"a dietetických potravín na základe verejného zdravotného poistenia a o zmene a doplnení niektorých"]
[null,null,"zákonov."]
[]
[null,null,"V  ","Zadajte miesto","dňa ","Zadajte dátum"]
[]
[null,null," ",null,null,null,"........................................................... \n"]
[null,null,null,null,null,null,{"$f":"IF(C29=\"Zadajte meno a priezvisko splnomocnenej osoby\",\"\",C29)","v":""}]
[null,null,null,null,null,null,"podpis"]
{"$rows_left_out":4}
{"sheet":"Config","index":2,"n_rows":4,"n_cols":2,"rows_kept":4,"cut":false,"hidden":true,"merged":[]}
["Vyberte položku zo zoznamu"]
["Držiteľ povolenia na uvedenie lieku na trh","L"]
["Výrobca zdravotníckej pomôcky","ZP"]
["Výrobca dietetickej potraviny","D"]

{"sheet":"Data","index":3,"n_rows":2,"n_cols":13,"rows_kept":2,"cut":false,"hidden":true,"merged":[]}
["Typ","VyrobcaObchodneMeno","VyrobcaSidlo","VyrobcaICO-DatNar","VyrobcaStatutarnyOrgan ","PPM_ObchodneMeno","PPM_sidlo","PPM_ICO-DatNar","PPM_StatutarnyOrgan ","SPM Meno a priezvisko:    ","SPM_AdresaTrvalehoPobytu","SPM_DatNar","Splnomocnenec"]
[{"$f":"IFERROR(VLOOKUP(Žiadosť!G9,Config!A:B,2,FALSE),\"\")","v":0},{"$f":"IF(OR(Žiadosť!G10=0,Žiadosť!G10=\"Zadajte text\"),\"\",Žiadosť!G10)","v":""},{"$f":"IF(OR(Žiadosť!G11=0,Žiadosť!G11=\"Zadajte text\"),\"\",Žiadosť!G11)","v":""},{"$f":"IF(OR(Žiadosť!G12=0,Žiadosť!G12=\"Zadajte text\"),\"\",Žiadosť!G12)","v":""},{"$f":"IF(OR(Žiadosť!G13=0,Žiadosť!G13=\"Zadajte text\"),\"\",Žiadosť!G13)","v":""},{"$f":"IF(OR(Žiadosť!G17=0,Žiadosť!G17=\"Zadajte text\"),\"\",Žiadosť!G17)","v":""},{"$f":"IF(OR(Žiadosť!G18=0,Žiadosť!G18=\"Zadajte text\"),\"\",Žiadosť!G18)","v":""},{"$f":"IF(OR(Žiadosť!G19=0,Žiadosť!G19=\"Zadajte text\"),\"\",Žiadosť!G19)","v":""},{"$f":"IF(OR(Žiadosť!G20=0,Žiadosť!G20=\"Zadajte text\"),\"\",Žiadosť!G20)","v":""},{"$f":"IF(OR(Žiadosť!G24=0,Žiadosť!G24=\"Zadajte text\"),\"\",Žiadosť!G24)","v":""},{"$f":"IF(OR(Žiadosť!G25=0,Žiadosť!G25=\"Zadajte text\"),\"\",Žiadosť!G25)","v":""},{"$f":"TEXT(IF(OR(Žiadosť!G26=0,Žiadosť!G26 =\"Zadajte text\"),\"\",Žiadosť!G26),\"d.m.yyyy\")","v":""},{"$f":"IF(OR(Žiadosť!C29=0,Žiadosť!C29=\"Zadajte text\"),\"\",Žiadosť!C29)","v":"Zadajte meno a priezvisko splnomocnenej osoby"}]