{"text_format":"2","workbook":"xlsx","n_sheets":22,"sheets":["Úvod","CBA - Agendové IS","Analyza citlivosti - AgendovéIS","Prínosy - Agendové IS","Výdavky - Agendové IS","Spotrebované cloudové služby","Parametre - Agendové IS","TCO","TCO - SW","TCO - HW","Faktory","Podklady>>>","TCO - Riešenie (bez HW a DB)","SW a aplikacie","eGovCloud - Parametre","Sumar MDs","Registre","Ciselniky","Klasifikacia pre Impl","Štandardné aktivity","Prinosy","MD rates"],"not_rendered":{"charts":0,"images":0,"macros":0,"external_links":1,"defined_names":2,"comments":4,"pivot_tables":0},"unopened":[],"bounds":{"document_bytes":16777216,"sheet_cells":100000,"run_cost":"one","rows_first":2000,"rows_last":500,"rows_between":2000,"halvings":0,"cell_chars":16384,"cell_head_chars":4096},"cells_cut":0,"cells_raw":0,"read":"whole","date_system":"1900"}

{"sheet":"Úvod","index":0,"n_rows":31,"n_cols":9,"rows_kept":31,"cut":false,"hidden":false,"merged":[[25,0,25,1],[25,2,25,8],[5,0,5,8],[7,0,9,8],[21,0,21,1],[21,2,21,8],[22,0,22,1],[22,2,22,8],[18,0,18,1],[18,2,18,8],[19,0,19,1],[19,2,19,8],[20,0,20,1],[20,2,20,8],[32,0,34,8],[30,6,31,7],[30,8,31,8],[6,0,6,8],[26,0,26,1],[26,2,26,8],[27,0,27,1],[27,2,27,8],[29,0,29,8],[30,0,31,1],[30,2,31,3],[30,4,31,5],[23,0,23,1],[23,2,23,8],[24,0,24,1],[24,2,24,8]]}
[]
[]
[]
[]
[]
["Príloha pre výpočet TCO a čistej súčasnej hodnoty z projektu"]
{"$rows_left_out":17}
{"sheet":"CBA - Agendové IS","index":1,"n_rows":14,"n_cols":12,"rows_kept":14,"cut":false,"hidden":false,"merged":[[2,10,2,11],[0,1,0,6],[0,7,0,11],[1,1,1,3],[1,4,1,6],[1,10,1,11]]}
[null,"Cashflow projektu",{"$nulls":5},"Čistá súčasná hodnota z projektu"]
[null,"Finančný cashflow",null,null,"Ekonomický cashflow",null,null,"koeficient obdobia","Finančná (FNPV)","Ekonomická (ENPV)","Kumulovaná diskont. návratnosť ENPV"]
["Obdobie","Alternat. A","Alternat. B","rozdiel","Alternat. A","Alternat. B","rozdiel"]
["t1",{"$f":"'Prínosy - Agendové IS'!Q4-'Výdavky - Agendové IS'!Q4","v":0},{"$f":"'Prínosy - Agendové IS'!R4-'Výdavky - Agendové IS'!R4","v":-5991305.00605},{"$f":"C4-B4","v":-5991305.00605},{"$f":"'Prínosy - Agendové IS'!T4-'Výdavky - Agendové IS'!Q4","v":0},{"$f":"'Prínosy - Agendové IS'!U4-'Výdavky - Agendové IS'!R4","v":-5991305.00605},{"$f":"F4-E4","v":-5991305.00605},0,{"$f":"D4*(1/(1+Faktory!$D$3)^H4)","v":-5991305.00605},{"$f":"G4*(1/(1+Faktory!$D$5)^H4)","v":-5991305.00605},{"$f":"J4","v":-5991305.00605},{"$f":"IF(K4>0,\"Rok návratu investície\",\"<\")","v":"<"}]
["t2",{"$f":"'Prínosy - Agendové IS'!Q5-'Výdavky - Agendové IS'!Q5","v":0},{"$f":"'Prínosy - Agendové IS'!R5-'Výdavky - Agendové IS'!R5","v":-4000580.9394750004},{"$f":"C5-B5","v":-4000580.9394750004},{"$f":"'Prínosy - Agendové IS'!T5-'Výdavky - Agendové IS'!Q5","v":0},{"$f":"'Prínosy - Agendové IS'!U5-'Výdavky - Agendové IS'!R5","v":-4000580.9394750004},-4000580.9394750004,1,{"$f":"D5*(1/(1+Faktory!$D$3)^H5)","v":-3846712.4418028845},{"$f":"G5*(1/(1+Faktory!$D$5)^H5)","v":-3810077.0852142856},{"$f":"J5+K4","v":-9801382.0912642851},{"$f":"IF(L4=\"<\",IF(K5>0,\"Rok návratu investície\",\"<\"),\">\")","v":"<"}]
["t3",{"$f":"'Prínosy - Agendové IS'!Q6-'Výdavky - Agendové IS'!Q6","v":0},{"$f":"'Prínosy - Agendové IS'!R6-'Výdavky - Agendové IS'!R6","v":-3815044.6834750003},-3815044.6834750003,{"$f":"'Prínosy - Agendové IS'!T6-'Výdavky - Agendové IS'!Q6","v":0},{"$f":"'Prínosy - Agendové IS'!U6-'Výdavky - Agendové IS'!R6","v":-3815044.6834750003},-3815044.6834750003,2,{"$f":"D6*(1/(1+Faktory!$D$3)^H6)","v":-3527223.2650471521},{"$f":"G6*(1/(1+Faktory!$D$5)^H6)","v":-3460357.9895464852},{"$f":"J6+K5","v":-13261740.08081077},{"$f":"IF(L5=\"<\",IF(K6>0,\"Rok návratu investície\",\"<\"),\">\")","v":"<"}]
{"$rows_left_out":9}
{"sheet":"Analyza citlivosti - AgendovéIS","index":2,"n_rows":12,"n_cols":12,"rows_kept":12,"cut":false,"hidden":false,"merged":[]}
[null,null,"ENPV",-3,-0.6,-0.4,-0.01,0,0.01,0.4,0.6,2]
[{"$f":"'Parametre - Agendové IS'!A3:A3","v":"Počet podaní"},0,{"$f":"'CBA - Agendové IS'!$J$14","v":1406598.9761166167},5114601.5205713827,2148199.4850075697,1900999.3153772522,1418958.9845981314,1406598.9761166167,1394238.9676351002,912198.63685598015,664998.46722566104,-1065402.7201865637]
[null,null,null,-3,-0.6,-0.4,-0.01,0,0.01,0.4,0.6,2]
[{"$f":"'Parametre - Agendové IS'!A13:A13","v":"Výška administratívneho poplatku"},0,{"$f":"'CBA - Agendové IS'!$J$14","v":1406598.9761166167},1406598.9761166167,1406598.9761166167,1406598.9761166167,1406598.9761166167,1406598.9761166167,1406598.9761166167,1406598.9761166167,1406598.9761166167,1406598.9761166167]
[null,null,null,-3,-0.6,-0.4,-0.01,0,0.01,0.4,0.6,2]
[{"$f":"'Parametre - Agendové IS'!A23:A23","v":"Trvanie spracovania podania"},0,{"$f":"'CBA - Agendové IS'!$J$14","v":1406598.9761166167},5114601.5205713827,2148199.4850075697,1900999.3153772522,1418958.9845981314,1406598.9761166167,1394238.9676351002,912198.63685598015,664998.46722566104,-1065402.7201865637]
{"$rows_left_out":7}
{"sheet":"Prínosy - Agendové IS","index":3,"n_rows":14,"n_cols":22,"rows_kept":14,"cut":false,"hidden":false,"merged":[[0,1,0,3],[0,4,0,15],[0,16,0,21],[1,1,1,3],[1,4,1,6],[1,7,1,9],[1,13,1,15],[1,16,1,18],[1,19,1,21],[1,10,1,12]]}
[null,"Priame prínosy",null,null,"Nepriame prínosy",{"$nulls":11},"Prínosy spolu"]
[null,"Administratívne poplatky",null,null,"Ostatné daňové a nedaňové príjmy",null,null,"Cena ušetreného času používateľa",null,null,"Úspora z prevádzky pri využívaní cloudových služieb",null,null,"Kvalitatívne prínosy vo finančnom vyjadrení",null,null,"Finančné prínosy",null,null,"Ekonomické prínosy"]
["Obdobie","Alternat. A","Alternat. B","rozdiel","Alternat. A","Alternat. B","rozdiel","Alternat. A","Alternat. B","rozdiel","Alternat. A","Alternat. B","rozdiel","Alternat. A","Alternat. B","rozdiel","Alternat. A","Alternat. B","rozdiel","Alternat. A","Alternat. B","rozdiel"]
["t1",{"$f":"IF(ISERR('Parametre - Agendové IS'!D3*'Parametre - Agendové IS'!D13),\"-\",'Parametre - Agendové IS'!D3*'Parametre - Agendové IS'!D13)","v":"-"},{"$f":"IF(ISERR('Parametre - Agendové IS'!E3*'Parametre - Agendové IS'!E13),\"-\",'Parametre - Agendové IS'!E3*'Parametre - Agendové IS'!E13)","v":"-"},{"$f":"IF(ISERR(C4-B4),\"-\",C4-B4)","v":"-"},null,null,{"$f":"IF(ISERR(F4-E4),\"-\",F4-E4)","v":0},0,{"$f":"IF(ISERR(Faktory!$D$11*'Parametre - Agendové IS'!E3*('Parametre - Agendové IS'!D33-'Parametre - Agendové IS'!E33)),\"-\",Faktory!$D$11*'Parametre - Agendové IS'!E3*('Parametre - Agendové IS'!D33-'Parametre - Agendové IS'!E33))","v":"-"},{"$f":"IF(ISERR(I4-H4),\"-\",I4-H4)","v":"-"},{"$f":"'Spotrebované cloudové služby'!D3","v":0},{"$f":"'Spotrebované cloudové služby'!E3","v":0},{"$f":"IF(ISERR(K4-L4),\"-\",K4-L4)","v":0},{"$f":"'Parametre - Agendové IS'!D53","v":0},{"$f":"'Parametre - Agendové IS'!E53","v":0},{"$f":"IF(ISERR(O4-N4),\"-\",O4-N4)","v":0},{"$f":"SUM(B4,E4)","v":0},{"$f":"SUM(C4,F4)","v":0},{"$f":"R4-Q4","v":0},{"$f":"SUM(H4,K4,N4,Q4)","v":0},{"$f":"SUM(I4,L4,O4,R4)","v":0},{"$f":"U4-T4","v":0}]
["t2",{"$f":"IF(ISERR('Parametre - Agendové IS'!D4*'Parametre - Agendové IS'!D14),\"-\",'Parametre - Agendové IS'!D4*'Parametre - Agendové IS'!D14)","v":"-"},{"$f":"IF(ISERR('Parametre - Agendové IS'!E4*'Parametre - Agendové IS'!E14),\"-\",'Parametre - Agendové IS'!E4*'Parametre - Agendové IS'!E14)","v":"-"},{"$f":"IF(ISERR(C5-B5),\"-\",C5-B5)","v":"-"},null,null,0,0,{"$f":"IF(ISERR(Faktory!$D$11*'Parametre - Agendové IS'!E4*('Parametre - Agendové IS'!D34-'Parametre - Agendové IS'!E34)),\"-\",Faktory!$D$11*'Parametre - Agendové IS'!E4*('Parametre - Agendové IS'!D34-'Parametre - Agendové IS'!E34))","v":"-"},{"$f":"IF(ISERR(I5-H5),\"-\",I5-H5)","v":"-"},{"$f":"'Spotrebované cloudové služby'!D4","v":0},{"$f":"'Spotrebované cloudové služby'!E4","v":0},0,{"$f":"'Parametre - Agendové IS'!D54","v":0},{"$f":"'Parametre - Agendové IS'!E54","v":0},{"$f":"IF(ISERR(O5-N5),\"-\",O5-N5)","v":0},{"$f":"SUM(B5,E5)","v":0},0,{"$f":"R5-Q5","v":0},0,0,{"$f":"U5-T5","v":0}]
["t3",{"$f":"IF(ISERR('Parametre - Agendové IS'!D5*'Parametre - Agendové IS'!D15),\"-\",'Parametre - Agendové IS'!D5*'Parametre - Agendové IS'!D15)","v":"-"},{"$f":"IF(ISERR('Parametre - Agendové IS'!E5*'Parametre - Agendové IS'!E15),\"-\",'Parametre - Agendové IS'!E5*'Parametre - Agendové IS'!E15)","v":"-"},"-",null,null,0,0,{"$f":"IF(ISERR(Faktory!$D$11*'Parametre - Agendové IS'!E5*('Parametre - Agendové IS'!D35-'Parametre - Agendové IS'!E35)),\"-\",Faktory!$D$11*'Parametre - Agendové IS'!E5*('Parametre - Agendové IS'!D35-'Parametre - Agendové IS'!E35))","v":"-"},{"$f":"IF(ISERR(I6-H6),\"-\",I6-H6)","v":"-"},{"$f":"'Spotrebované cloudové služby'!D5","v":0},{"$f":"'Spotrebované cloudové služby'!E5","v":0},0,{"$f":"'Parametre - Agendové IS'!D55","v":0},{"$f":"'Parametre - Agendové IS'!E55","v":0},0,0,0,0,0,0,0]
{"$rows_left_out":9}
{"sheet":"Výdavky - Agendové IS","index":4,"n_rows":15,"n_cols":19,"rows_kept":15,"cut":false,"hidden":false,"merged":[[0,1,0,9],[0,10,0,15],[0,16,0,18],[1,1,1,3],[1,4,1,6],[1,7,1,9],[1,10,1,12],[1,13,1,15]]}
[null,"Fixné výdavky",{"$nulls":8},"Variabilné výdavky",{"$nulls":5},"Výdavky spolu"]
[null,"HW",null,null,"SW",null,null,"Služby",null,null,"Všeobecný materiál",null,null,"Osobné náklady"]
["Obdobie","Alternat. 1","Alternat. 2","rozdiel","Alternat. 1","Alternat. 2","rozdiel","Alternat. 1","Alternat. 2","rozdiel","Alternat. 1","Alternat. 2","rozdiel","Alternat. 1","Alternat. 2","rozdiel","Alternat. 1","Alternat. 2","rozdiel"]
["t1",{"$f":"TCO!D$21","v":0},{"$f":"TCO!D$11+TCO!D$12","v":53333.333333333336},{"$f":"C4-B4","v":53333.333333333336},{"$f":"TCO!D$20","v":0},{"$f":"TCO!D$7+TCO!D$8","v":1720000},{"$f":"F4-E4","v":1720000},{"$f":"TCO!D$24-(TCO!D$20+TCO!D$21)","v":0},{"$f":"TCO!D$9+TCO!D$10","v":4217971.6727166669},{"$f":"I4-H4","v":4217971.6727166669},{"$f":"IF(ISERR(Faktory!$D$9*'Parametre - Agendové IS'!D3),\"-\",Faktory!$D$9*'Parametre - Agendové IS'!D3)","v":0},{"$f":"IF(ISERR(Faktory!$D$9*'Parametre - Agendové IS'!E3),\"-\",Faktory!$D$9*'Parametre - Agendové IS'!E3)","v":0},{"$f":"IF(ISERR(L4-K4),\"-\",L4-K4)","v":0},{"$f":"IF(ISERR(Faktory!$D$7*'Parametre - Agendové IS'!D3*'Parametre - Agendové IS'!D23*'Parametre - Agendové IS'!D43),\"-\",Faktory!$D$7*'Parametre - Agendové IS'!D3*'Parametre - Agendové IS'!D23*'Parametre - Agendové IS'!D43)","v":"-"},{"$f":"IF(ISERR(Faktory!$D$7*'Parametre - Agendové IS'!E3*'Parametre - Agendové IS'!E23*'Parametre - Agendové IS'!E43),\"-\",Faktory!$D$7*'Parametre - Agendové IS'!E3*'Parametre - Agendové IS'!E23*'Parametre - Agendové IS'!E43)","v":"-"},{"$f":"IF(ISERR(O4-N4),\"-\",O4-N4)","v":"-"},{"$f":"SUM(B4,E4,H4,K4,N4)","v":0},{"$f":"SUM(C4,F4,I4,L4,O4)","v":5991305.00605},{"$f":"R4-Q4","v":5991305.00605}]
["t2",{"$f":"TCO!E$21","v":0},{"$f":"TCO!E$11+TCO!E$12","v":355733.33333333331},{"$f":"C5-B5","v":355733.33333333331},{"$f":"TCO!E$20","v":0},{"$f":"TCO!E$7+TCO!E$8","v":0},{"$f":"F5-E5","v":0},{"$f":"TCO!E$24-(TCO!E$20+TCO!E$21)","v":0},{"$f":"TCO!E$9+TCO!E$10","v":3644847.6061416669},{"$f":"I5-H5","v":3644847.6061416669},{"$f":"IF(ISERR(Faktory!$D$9*'Parametre - Agendové IS'!D4),\"-\",Faktory!$D$9*'Parametre - Agendové IS'!D4)","v":0},{"$f":"IF(ISERR(Faktory!$D$9*'Parametre - Agendové IS'!E4),\"-\",Faktory!$D$9*'Parametre - Agendové IS'!E4)","v":0},{"$f":"IF(ISERR(L5-K5),\"-\",L5-K5)","v":0},{"$f":"IF(ISERR(Faktory!$D$7*'Parametre - Agendové IS'!D4*'Parametre - Agendové IS'!D24*'Parametre - Agendové IS'!D44),\"-\",Faktory!$D$7*'Parametre - Agendové IS'!D4*'Parametre - Agendové IS'!D24*'Parametre - Agendové IS'!D44)","v":"-"},{"$f":"IF(ISERR(Faktory!$D$7*'Parametre - Agendové IS'!E4*'Parametre - Agendové IS'!E24*'Parametre - Agendové IS'!E44),\"-\",Faktory!$D$7*'Parametre - Agendové IS'!E4*'Parametre - Agendové IS'!E24*'Parametre - Agendové IS'!E44)","v":"-"},{"$f":"IF(ISERR(O5-N5),\"-\",O5-N5)","v":"-"},{"$f":"SUM(B5,E5,H5,K5,N5)","v":0},4000580.9394750004,{"$f":"R5-Q5","v":4000580.9394750004}]
["t3",{"$f":"TCO!F$21","v":0},{"$f":"TCO!F$11+TCO!F$12","v":471822.67733333335},471822.67733333335,{"$f":"TCO!F$20","v":0},{"$f":"TCO!F$7+TCO!F$8","v":0},0,{"$f":"TCO!F$24-(TCO!F$20+TCO!F$21)","v":0},{"$f":"TCO!F$9+TCO!F$10","v":3343222.0061416668},3343222.0061416668,{"$f":"IF(ISERR(Faktory!$D$9*'Parametre - Agendové IS'!D5),\"-\",Faktory!$D$9*'Parametre - Agendové IS'!D5)","v":0},{"$f":"IF(ISERR(Faktory!$D$9*'Parametre - Agendové IS'!E5),\"-\",Faktory!$D$9*'Parametre - Agendové IS'!E5)","v":0},{"$f":"IF(ISERR(L6-K6),\"-\",L6-K6)","v":0},{"$f":"IF(ISERR(Faktory!$D$7*'Parametre - Agendové IS'!D5*'Parametre - Agendové IS'!D25*'Parametre - Agendové IS'!D45),\"-\",Faktory!$D$7*'Parametre - Agendové IS'!D5*'Parametre - Agendové IS'!D25*'Parametre - Agendové IS'!D45)","v":"-"},{"$f":"IF(ISERR(Faktory!$D$7*'Parametre - Agendové IS'!E5*'Parametre - Agendové IS'!E25*'Parametre - Agendové IS'!E45),\"-\",Faktory!$D$7*'Parametre - Agendové IS'!E5*'Parametre - Agendové IS'!E25*'Parametre - Agendové IS'!E45)","v":"-"},{"$f":"IF(ISERR(O6-N6),\"-\",O6-N6)","v":"-"},0,3815044.6834750003,3815044.6834750003]
{"$rows_left_out":10}
{"sheet":"Spotrebované cloudové služby","index":5,"n_rows":12,"n_cols":14,"rows_kept":12,"cut":false,"hidden":false,"merged":[[0,10,0,11],[0,12,0,13],[2,0,11,0],[2,1,11,1],[0,3,0,5],[0,6,0,7],[0,8,0,9]]}
[null,null,null,"SPOLU",null,null,"cloudová služba 1",null,"cloudová služba 2",null,"cloudová služba 3",null,"cloudová služba N"]
["Parameter","Jednotka","Obdobie","Alternat. 1","Alternat. 2","rozdiel","Alternat. 1","Alternat. 2","Alternat. 1","Alternat. 2","Alternat. 1","Alternat. 2","Alternat. 1","Alternat. 2"]
["Spotrebovávané cloudové služby\nParameter je vyhodnocovaný ako úspora z prevádzky (v časti prínosy)","EUR","t1",{"$f":"SUM(G3,I3,K3,M3)","v":0},{"$f":"SUM(H3,J3,L3,N3)","v":0},{"$f":"E3-D3","v":0}]
[null,null,"t2",{"$f":"SUM(G4,I4,K4,M4)","v":0},{"$f":"SUM(H4,J4,L4,N4)","v":0},{"$f":"E4-D4","v":0}]
[null,null,"t3",0,0,0]
[null,null,"t4",0,0,0]
{"$rows_left_out":7}
{"sheet":"Parametre - Agendové IS","index":6,"n_rows":62,"n_cols":15,"rows_kept":62,"cut":false,"hidden":false,"merged":[[0,6,0,7],[0,8,0,9],[0,10,0,11],[22,0,31,0],[22,1,31,1],[52,0,61,0],[52,1,61,1],[32,0,41,0],[32,1,41,1],[42,0,51,0],[42,1,51,1],[0,12,0,13],[2,0,11,0],[2,1,11,1],[12,0,21,0],[12,1,21,1],[0,3,0,5]]}
[null,null,null,"SPOLU",null,null,"Skupina služieb 1",null,"Skupina služieb 2",null,"Skupina služieb 3",null,"Skupina služieb N",null,"% zmena"]
["Parameter","Jednotka","Obdobie","Alternat. 1","Alternat. 2","rozdiel","Alternat. 1","Alternat. 2","Alternat. 1","Alternat. 2","Alternat. 1","Alternat. 2","Alternat. 1","Alternat. 2"]
["Počet podaní","počet / rok","t1",{"$f":"SUM(G3,I3,K3,M3)","v":0},{"$f":"SUM(H3,J3,L3,N3)+SUM(H3,J3,L3,N3)*$O$3","v":0},{"$f":"E3-D3","v":0},{"$nulls":8},{"$f":"'Analyza citlivosti - AgendovéIS'!B2","v":0}]
[null,null,"t2",{"$f":"SUM(G4,I4,K4,M4)","v":0},0,{"$f":"E4-D4","v":0}]
[null,null,"t3",0,0,0]
[null,null,"t4",300000,50000,-250000,300000,50000]
{"$rows_left_out":57}
{"sheet":"TCO","index":7,"n_rows":28,"n_cols":13,"rows_kept":28,"cut":false,"hidden":false,"merged":[[4,3,4,12],[15,0,15,2],[17,3,17,12]]}
["Celkové náklady na vlastníctvo (TCO)"]
[]
["Počet používateľov :"]
[]
[null,null,null,"Rok"]
["P.č.",null,"Spolu","t1","t2","t3","t4","t5","t6","t7","t8","t9","t10"]
{"$rows_left_out":23}
{"sheet":"TCO - SW","index":8,"n_rows":128,"n_cols":8,"rows_kept":128,"cut":false,"hidden":false,"merged":[[118,0,127,0],[118,1,127,1],[118,2,127,2],[0,0,0,3],[98,0,107,0],[98,1,107,1],[98,2,107,2],[108,0,117,0],[108,1,117,1],[108,2,117,2],[78,0,87,0],[78,1,87,1],[78,2,87,2],[88,0,97,0],[88,1,97,1],[88,2,97,2],[55,0,55,2],[57,0,66,0],[57,1,66,1],[57,2,66,2],[67,0,76,0],[67,1,76,1],[67,2,76,2],[35,0,44,0],[35,1,44,1],[35,2,44,2],[2,0,2,2],[45,0,54,0],[45,1,54,1],[45,2,54,2],[14,0,23,0],[14,1,23,1],[14,2,23,2],[25,0,34,0],[25,1,34,1],[25,2,34,2],[4,2,13,2],[4,0,13,0],[4,1,13,1]]}
["Náklady na obstaranie a prevádzku SW",null,null,null,"SPOLU","MDM Rezortná zbernica","MDM Portál","MDM Dátový server"]
["Názov","Účet/skupina výdavkov","Kód EKO klasifikácie","Obdobie"]
["Vytvorenie riešenia - obstaranie",null,null,null,{"$f":"E4+E25","v":8033762.8850000007},{"$f":"F4+F25","v":5623634.0194999995},{"$f":"G4+G25","v":803376.28850000002},{"$f":"H4+H25","v":1606752.577}]
["SW produkty",null,null,null,{"$f":"SUM(E5:E24)","v":1720000},{"$f":"SUM(F5:F24)","v":1204000},{"$f":"SUM(G5:G24)","v":172000},{"$f":"SUM(H5:H24)","v":344000}]
["Obstaranie, inštalácia SW produktu vrátane licencie k SW","013 Softvér",711003,"t1",{"$f":"SUM(F5:H5)","v":1720000},{"$f":"'SW a aplikacie'!C15","v":1204000},{"$f":"'SW a aplikacie'!D15","v":172000},{"$f":"'SW a aplikacie'!E15","v":344000}]
[null,null,null,"t2",{"$f":"SUM(F6:H6)","v":0}]
{"$rows_left_out":123}
{"sheet":"TCO - HW","index":9,"n_rows":84,"n_cols":15,"rows_kept":84,"cut":false,"hidden":false,"merged":[[0,0,0,3],[64,0,73,0],[64,1,73,1],[64,2,73,2],[74,0,83,0],[74,1,83,1],[74,2,83,2],[44,0,53,0],[44,1,53,1],[44,2,53,2],[54,0,63,0],[54,1,63,1],[54,2,63,2],[34,0,43,0],[34,1,43,1],[34,2,43,2],[2,0,2,2],[23,0,32,0],[23,1,32,1],[23,2,32,2],[33,0,33,2],[3,0,12,0],[3,1,12,1],[3,2,12,2],[13,0,22,0],[13,1,22,1],[13,2,22,2]]}
["Náklady na obstaranie a prevádzku HW",null,null,null,"SPOLU","eGov služba - VM pre portál - produkcia","eGov služba - VM pre integračná platforma - produkcia","eGov služba - VM pre DB server (všetky prostredia)","eGov služba - VM pre testovacie a školiace prostredia","eGov služba - storage SAN VM","eGov služba - storage so zálohovaním, DB priestory","eGov služba - storage so zálohovaním, DB priestory","Projektové vývojové prostredie","Výkon - návrh, inštalácia a prevádzka cloudu","HW položka N"]
["Názov","Účet/skupina výdavkov","Kód EKO klasifikácie","Obdobie"]
["Obstaranie",null,null,null,{"$f":"SUM(E4:E33)","v":0},{"$f":"SUM(F4:F33)","v":0},{"$f":"SUM(G4:G33)","v":0},{"$f":"SUM(H4:H33)","v":0},0,0,0,0,0,0,{"$f":"SUM(O4:O33)","v":0}]
["Nákup, inštalácia a sprevádzkovanie HW \nvrátane systémového SW","022 Samostatné hnuteľné veci\n a súbory hnuteľných vecí",713002,"t1",{"$f":"SUM(F4:O4)","v":0}]
[null,null,null,"t2",0]
[null,null,null,"t3",0]
{"$rows_left_out":79}
{"sheet":"Faktory","index":10,"n_rows":13,"n_cols":4,"rows_kept":13,"cut":false,"hidden":false,"merged":[[2,0,3,0],[2,3,3,3],[4,0,5,0],[4,3,5,3],[6,0,7,0],[6,3,7,3],[6,1,7,1],[2,1,3,1],[2,2,3,2],[6,2,7,2],[4,2,5,2],[10,2,11,2],[10,0,11,0],[10,1,11,1],[10,3,11,3],[8,0,9,0],[8,3,9,3],[8,2,9,2],[8,1,9,1]]}
["Názov","Popis","Jednotka","Hodnota"]
["Životnosť projektu (t)","Referenčné obdobie je počet rokov, na ktorý sa vo finančnej analýze (analýze nákladov a výnosov) uvádzajú predpovede. Predpovede týkajúce sa budúceho trendu projektu by sa mali formulovať na obdobie, ktoré je primerané jeho ekonomicky užitočnému trvaniu a ktoré je dosť dlhé na to, aby zahŕňalo jeho pravdepodobné dlhodobejšie dosahy. Ide o časové obdobie, kedy je možné overiť úspešnosť investície. Trvanie sa mení podľa povahy investície. Referenčný časový horizont v rokoch podľa sektorov je uvedený podľa prílohy 1 Delegovaného nariadenia Komisie (EÚ) 480/2014 z 3. marca 2014, ktorým sa dopĺňa všeobecné nariadenie.","rok",10]
["Referenčná diskontná sadzba (i)","Diskontná sadzba, ktorá sa má používať vo finančnej analýze má informovať investora o alternatívnych kapitálových nákladoch. Môže sa za ňu považovať ušlý výnos najlepšieho alternatívneho projektu.\nV prípade verejných investičných projektov spolufinancovaných z fondov sa stanovuje 4 % finančná diskontná sadzbu pre výpočet čistej súčasnej hodnoty investície v stálych cenách roku predloženia žiadosti o NFP.\n","%",0.04]
[]
["Sociálna diskontná sadzba (r)","Cieľom CBA je preukázať pri štrukturálne významných investíciách, že ekonomická čistá súčasná hodnota za dané obdobie a pri stanovenej sociálnej diskontnej sadzbe je kladná.","%",0.05]
[null,"Diskontovanie odhadovaných nákladov a prínosov: keď sa odhadne tok ekonomických nákladov a prínosov, mala by sa uplatniť štandardná diskontovaná metodika peňažného toku pomocou sociálnej diskontnej sadzby"]
{"$rows_left_out":8}
{"sheet":"Podklady>>>","index":11,"n_rows":0,"n_cols":0,"rows_kept":0,"cut":false,"hidden":false,"merged":[]}

{"sheet":"TCO - Riešenie (bez HW a DB)","index":12,"n_rows":42,"n_cols":7,"rows_kept":42,"cut":false,"hidden":false,"merged":[[0,0,2,0],[0,1,0,3],[0,4,2,4],[0,5,1,6],[1,1,2,1],[1,2,1,3]]}
["Popis","Náklady",null,null,"Predpoklady","Požiadavky"]
[null,"Obstaranie (roky 1 - 3)","Rok prevádzky"]
[null,null,"%","€",null,"Počet","Typ"]
["Infraštruktúra (požiadavky na umiestnenie v cloude)"]
["eGov služba - Pripojenie k sieťovým uzlom"]
["eGov služba - VM pre portál - produkcia",{"$f":"F6*'[1]eGovCloud - Parametre'!$B$9*'[1]eGovCloud - Parametre'!$B$7","v":23503.68},null,{"$f":"F6*'[1]eGovCloud - Parametre'!$B$9","v":23503.68},"Uvedené VM sú spolu porovnatelné s 1 server 4CPU - 8Cores - 128GB RAM",8,"Virtual Machine"]
{"$rows_left_out":37}
{"sheet":"SW a aplikacie","index":13,"n_rows":36,"n_cols":6,"rows_kept":36,"cut":false,"hidden":false,"merged":[[1,1,1,5]]}
[]
[null,"SW a aplikácie - rozdelenie po moduloch a hlavných aktivitách"]
[]
[null,null,"MDM Rezortná zbernica","MDM Portál","MDM Dátový server","SPOLU"]
[null,"Analýza a dizajn",{"$f":"SUM(C6:C7)","v":950560.25487499987},{"$f":"SUM(D6:D7)","v":135794.32212500001},271588.64425000001,{"$f":"SUM(C5:E5)","v":1357943.2212499999}]
[null,"Vývoj riešenia MDM + Konsolidácia",{"$f":"'[1]TCO - Riešenie (bez HW a DB)'!$B$24*'[1]Štandardné aktivity'!$D$24*'[1]Štandardné aktivity'!$D$7","v":864145.68624999991},{"$f":"'[1]TCO - Riešenie (bez HW a DB)'!$B$24*'[1]Štandardné aktivity'!$D$25*'[1]Štandardné aktivity'!$D$7","v":123449.38374999999},{"$f":"'[1]TCO - Riešenie (bez HW a DB)'!$B$24*'[1]Štandardné aktivity'!$D$26*'[1]Štandardné aktivity'!$D$7","v":246898.76749999999},{"$f":"SUM(C6:E6)","v":1234493.8374999999}]
{"$rows_left_out":31}
{"sheet":"eGovCloud - Parametre","index":14,"n_rows":19,"n_cols":5,"rows_kept":19,"cut":false,"hidden":false,"merged":[[1,1,1,4]]}
[]
[null,"e-GovCloud Parametre"]
[]
[null,"Popis","Počet","Poznámka","Link"]
[null,"Spolu VM",{"$f":"'[1]TCO - Riešenie (bez HW a DB)'!F6+'[1]TCO - Riešenie (bez HW a DB)'!F7+'[1]TCO - Riešenie (bez HW a DB)'!F9","v":28}]
[null,"GiB per VM",40,"diskový priestor pre OS"]
{"$rows_left_out":14}
{"sheet":"Sumar MDs","index":15,"n_rows":30,"n_cols":10,"rows_kept":30,"cut":false,"hidden":false,"merged":[[1,1,1,4],[21,1,21,3]]}
[]
[null,"Sumár MDs"]
[]
[null,"Kategória registra","Trieda","Počet","MDs na register","MDs Celkovo",null,"Faktory pre výpočet",null,"Poznámka"]
[null,{"$f":"'[1]Klasifikacia pre Impl'!A2","v":"číselník"},"Vzorové",{"$f":"IF('[1]Klasifikacia pre Impl'!B2>=I$5,I$5,'[1]Klasifikacia pre Impl'!B2)","v":10},{"$f":"VLOOKUP(B5,'[1]Klasifikacia pre Impl'!$A$2:$C$6,3)","v":20},{"$f":"D5*E5","v":200},null,"Počet vzorových implementácií pre kategóriu registra",10,"Výchádza z počtu organizácií (list \"Registre\", stĺpec \"Správca\")"]
[null,{"$f":"'[1]Klasifikacia pre Impl'!A2","v":"číselník"},"Ďalšie",{"$f":"'[1]Klasifikacia pre Impl'!B2-D5","v":112},{"$f":"VLOOKUP(B6,'[1]Klasifikacia pre Impl'!$A$2:$C$6,3)*(1-$I$6)","v":10},{"$f":"D6*E6","v":1120},null,"Úspora pri znovupoužití postupov pre číselníky",0.5]
{"$rows_left_out":25}
{"sheet":"Registre","index":16,"n_rows":63,"n_cols":17,"rows_kept":63,"cut":false,"hidden":false,"merged":[]}
[null,"Zoznam registrov"]
[null,"36 RUVZ a 22 komor"]
[null,"Názov","Správca","Legislatíva/Predpis","Typ","Klasifikácia","IS","Zdroje dát","Vstupné rozhrania","Výstupné rozhrania","Automatizácia","Sizing v MB","Poznámka","Počet atribútov","Významnosť IS","Náklady na integráciu","Fáza projektu (rok)"]
[null,"Národný register poskytovateľov zdravotnej starostlivosti","NCZI","Zákon 153/2013, Vyhl. 9/2014","Register","Referenčný","JRÚZ/ISZI","iné registre","csv/txt, xml",null,"poloautomatický",null,null,63,3,{"$f":"'[1]Sumar MDs'!$C$27","v":200000},"t2"]
[null,"Národný register zdravotníckych pracovníkov","NCZI","Zákon 153/2013, Vyhl. 9/2014","Register","Referenčný","JRÚZ/ISZI","iné registre","csv/txt, xml, xls",null,"poloautomatický",null,null,122,3,{"$f":"'[1]Sumar MDs'!$C$27","v":200000},"t2"]
[null,"Národný register prijímateľov zdravotnej staroslivosti","NCZI","nie je","Register","Referenčný","JRÚZ/ISZI","iné registre","xml",null,"poloautomatický",null,null,469,3,{"$f":"'[1]Sumar MDs'!$C$27","v":200000},"t2"]
{"$rows_left_out":58}
{"sheet":"Ciselniky","index":17,"n_rows":126,"n_cols":3,"rows_kept":126,"cut":false,"hidden":false,"merged":[]}
[]
[null,"Zoznam číselníkov"]
[]
[null,"Názov číselníka","Vlastný/preberaný"]
[null,"Stav kategorizácie"]
[null,"Stav registrácie"]
{"$rows_left_out":121}
{"sheet":"Klasifikacia pre Impl","index":18,"n_rows":9,"n_cols":4,"rows_kept":9,"cut":false,"hidden":false,"merged":[[1,1,1,3]]}
[]
[null,"Zoznam číselníkov"]
[]
[null,"Kategória registra","Počet registrov","Počet MDs\nna vzorový register"]
[null,"číselník",122,20]
[null,"manuálny",32,200]
{"$rows_left_out":4}
{"sheet":"Štandardné aktivity","index":19,"n_rows":25,"n_cols":4,"rows_kept":25,"cut":false,"hidden":false,"merged":[[4,3,7,3]]}
[]
[null,"Štandarné aktivity pri tvorbe integračných kosolidačných projektov a ich náročnosť"]
[]
[null,"#","Názov aktivity","Pomer prác"]
[null,1,"Analýza integračného business procesu",0.25]
[null,2,"Analýza interfejsových konektorov"]
{"$rows_left_out":20}
{"sheet":"Prinosy","index":20,"n_rows":31,"n_cols":3,"rows_kept":31,"cut":false,"hidden":false,"merged":[]}
[]
[null,"Parametre prínosov"]
[]
[null,"Úspora nákladov vyplývajúca z cloudového riešenia"]
[]
[null,"Úspora prevádzkových nákladov oproti súčasným riešeniam",0.1]
{"$rows_left_out":26}
{"sheet":"MD rates","index":21,"n_rows":16,"n_cols":5,"rows_kept":16,"cut":false,"hidden":false,"merged":[]}
[]
[null,"Priemerný náklad na vývoj v EUR/človekodeň"]
[]
[null,"Pozícia","EUR/ČD","Podiel"]
[null,"IT architekt",910,0.02,{"$f":"C5*D5","v":18.2}]
[null,"IT tester",570,0.12,{"$f":"C6*D6","v":68.399999999999991}]
{"$rows_left_out":10}